{"text_format":"3","workbook":"xlsx","n_sheets":5,"sheets":["INICIO","INSTRUCTIVO","TARIFAS","FORMULARIO","LIQUIDACION"],"not_rendered":{"images":2,"macros":1,"defined_names":5},"read":"whole","date_system":"1900"}

{"sheet":"INICIO","index":0,"n_rows":3,"n_cols":2,"rows_kept":3,"merged":[[1,1,1,5],[2,1,2,5]]}
[]
[null,"FORMATO SOLICITUD COMPRA"]
[null,"TIQUETES PREPAGO"]

{"sheet":"INSTRUCTIVO","index":1,"n_rows":11,"n_cols":2,"rows_kept":11,"merged":[[10,1,12,1]]}
[]
[]
[]
[]
[null," IN-GF- 001 INSTRUCTIVO DE COMPRA DE TIQUETES"]
[null,"VERSIÓN 005                                     FECHA VERSIÓN: 01/02/2023"]
[]
[]
[]
[]
[null,"1.\tAl seleccionar el botón “FORMULARIO DE COMPRA”, diligenciar la información correspondiente al solicitante: nombre o razón social, documento de identificación o NIT, dirección de recepción de los tiquetes prepago.\n2.\tSeleccione la (s) estación (es) de peje sobre las cuales realizará la compra.\n3.\tUna vez se despliegue la información de tarifas por categoría (tomar en cuenta que las categorias pueden variar en algunas estaciones), diligenciar las casillas (color gris) con el número de tiquetes prepago por cada estación y cada categoría. \n4.\tEn la última columna del formulario podrá visualizar el valor de los tiquetes por cada estación de peaje.\n5.\tEn el margen inferior derecho el usuario podrá visualizar el valor total de la compra.\n6.\tRealizada la verificación de la información por parte del usuario, pulsar el botón “LIQUIDACIÓN”.\n7.\tEn el formulario de liquidación, el usuario podrá visualizar toda la información diligenciada en el “FORMULARIO DE COMPRA”.\n8.\tAdicionalmente, el formulario liquidará el valor correspondiente a los gastos bancarios y los gastos de envío para totalizar el valor de la compra. El usuario seleccionara la opcion del lugar de la consigancion si es Local (Bogota) o a nivel Nacional.\n9.\tEl usuario debe imprimir el formato de liquidación y firmarlo, puesto que el archivo será el soporte que garantice el pago efectuado para que la Unión Temporal despache los tiquetes adquiridos.\n\n10.\tProceso de pago, validación del pago y entrega de tiquetes prepago:\n\n11.\tUna vez el usuario tenga a su disposición el valor de adquisición de los tiquetes prepago (“FORMULARIO DE COMPRA”), deberá realizar el pago en el Banco Davivienda a la siguiente cuenta bancaria:\n\n12.\t-\tNo. Cuenta: \t\t\t482800024150\n13.\t-\tTipo de cuenta:\t\tAhorros\n14.\t-\tNombre de la cuenta:\t\tPA Peajes Nacionales Tiquetes Prepago\n15.\t-\tTitular: \t\t\tPA FIDUCIARIA CORFICOLOMBIANA SA\n16.\t-\tNIT:\t\t\t\t800.256.769-6\n17.\tRealizado el pago, en la casilla “Pegar Consignación” de la Liquidación, el usuario debe proceder a pegar el soporte de consignación y escanear dicho documento completo.\n18.\tPosteriormente debe remitir al correo “prepagos@utpeajesnacionales.com.co” el documento digital (escaneado).\n19.\tUna vez la UT reciba la información del pago, procederá a la verificación del ingreso a la respectiva cuenta.\n20.\tIdentificado el ingreso realizado por el usuario, la Unión Temporal contará con tres (3) días hábiles para el envío si el destino es Bogotá D.C., y seis (6) días hábiles para el envío a destino nacional."]

{"sheet":"TARIFAS","index":2,"n_rows":81,"n_cols":30,"rows_kept":81,"hidden":true,"merged":[[7,0,8,0],[7,1,8,1],[7,2,8,2],[7,3,7,20],[7,21,7,24],[7,25,8,25],[48,0,49,0],[48,1,49,1],[48,2,49,2],[48,3,48,22],[48,23,48,26],[48,27,49,27],[48,28,49,28],[48,29,49,29]]}
[]
[null,null,"TARIFAS 16 ENE 2023 AL 15 ENE 2024"]
[null,null,"IPC DIC 2020",105.48]
[null,null,"IPC DIC 2021",111.41]
[null,null,"FACTOR",{"v":1.0562191884717482,"d":"1.0562"}]
[]
[null,1,{"$f":"+B7+1","v":2},{"$f":"+C7+1","v":3},4,5,6,7,8,9,10,11,{"$f":"+L7+1","v":12},{"$f":"+M7+1","v":13},{"$f":"+N7+1","v":14},{"$f":"+O7+1","v":15},{"$f":"+P7+1","v":16},17,18,19,20,21,22,23,24,25]
["No.","Estación de Peaje","Departamento","CATEGORÍAS VEHICULARES",{"$nulls":17},"EJES",{"$nulls":3},"FOSEVI"]
[{"$nulls":3},"I","IE","IEA","IEB","II","IIE","IIEE","III","IIIE","IIIP","IIIG","IV","IVE","V","VB","VE","VI","VII","E. GRUA","E. REMOL.","E. ADIC.","E. CAÑERO"]
[1,"CASABLANCA","CUNDINAMARCA",{"v":9100,"d":"$ 9,100"},0,0,0,{"v":9800,"d":"$ 9,800"},0,0,{"v":25600,"d":"$ 25,600"},0,0,0,{"v":31800,"d":"$ 31,800"},0,{"v":37200,"d":"$ 37,200"},0,0,0,0,{"v":7500,"d":"$ 7,500"},{"v":10800,"d":"$ 10,800"},{"v":11000,"d":"$ 11,000"},0,{"v":300,"d":"$ 300"}]
[{"$f":"A10+1","v":2},"SABOYÁ","BOYACA",{"v":9100,"d":"$ 9,100"},{"v":2400,"d":"$ 2,400"},0,0,{"v":9800,"d":"$ 9,800"},{"v":2400,"d":"$ 2,400"},0,{"v":25600,"d":"$ 25,600"},0,0,0,{"v":31800,"d":"$ 31,800"},0,{"v":37200,"d":"$ 37,200"},0,0,0,0,{"v":7500,"d":"$ 7,500"},{"v":10800,"d":"$ 10,800"},{"v":11000,"d":"$ 11,000"},0,{"v":300,"d":"$ 300"}]
[{"$f":"A11+1","v":3},"OIBA","SANTANDER",{"v":9100,"d":"$ 9,100"},{"v":800,"d":"$ 800"},0,0,{"v":9800,"d":"$ 9,800"},{"v":800,"d":"$ 800"},0,{"v":25600,"d":"$ 25,600"},0,0,0,{"v":31800,"d":"$ 31,800"},0,{"v":37200,"d":"$ 37,200"},0,0,0,0,{"v":7500,"d":"$ 7,500"},{"v":10800,"d":"$ 10,800"},{"v":11000,"d":"$ 11,000"},0,{"v":300,"d":"$ 300"}]
[4,"CURITI","SANTANDER",{"v":9100,"d":"$ 9,100"},{"v":6900,"d":"$ 6,900"},0,0,{"v":9800,"d":"$ 9,800"},0,0,{"v":25600,"d":"$ 25,600"},0,0,0,{"v":31800,"d":"$ 31,800"},0,{"v":37200,"d":"$ 37,200"},0,0,0,0,{"v":7500,"d":"$ 7,500"},{"v":10800,"d":"$ 10,800"},{"v":11000,"d":"$ 11,000"},0,{"v":300,"d":"$ 300"}]
[5,"LOS CUROS","SANTANDER",{"v":9100,"d":"$ 9,100"},0,0,0,{"v":9800,"d":"$ 9,800"},0,0,{"v":25600,"d":"$ 25,600"},0,0,0,{"v":31800,"d":"$ 31,800"},0,{"v":37200,"d":"$ 37,200"},0,0,0,0,{"v":7500,"d":"$ 7,500"},{"v":10800,"d":"$ 10,800"},{"v":11000,"d":"$ 11,000"},0,{"v":300,"d":"$ 300"}]
[6,"PLATANAL","CESAR",{"v":8800,"d":"$ 8,800"},{"v":200,"d":"$ 200"},0,0,{"v":9800,"d":"$ 9,800"},{"v":200,"d":"$ 200"},{"v":5100,"d":"$ 5,100"},{"v":20900,"d":"$ 20,900"},{"v":10700,"d":"$ 10,700"},0,0,{"v":26500,"d":"$ 26,500"},{"v":13500,"d":"$ 13,500"},{"v":30400,"d":"$ 30,400"},0,{"v":15300,"d":"$ 15,300"},0,0,{"v":7100,"d":"$ 7,100"},{"v":9300,"d":"$ 9,300"},{"v":9600,"d":"$ 9,600"},0,{"v":200,"d":"$ 200"}]
[7,"SAN DIEGO","CESAR",{"v":5200,"d":"$ 5,200"},{"v":3600,"d":"$ 3,600"},0,0,{"v":5600,"d":"$ 5,600"},0,0,{"v":6100,"d":"$ 6,100"},0,0,0,{"v":6500,"d":"$ 6,500"},0,{"v":13700,"d":"$ 13,700"},{"v":29700,"d":"$ 29,700"},0,{"v":39700,"d":"$ 39,700"},{"v":45100,"d":"$ 45,100"},0,0,0,0,{"v":200,"d":"$ 200"}]
[8,"RINCÓN HONDO","CESAR",{"v":10500,"d":"$ 10,500"},0,0,0,{"v":11100,"d":"$ 11,100"},0,0,{"v":12000,"d":"$ 12,000"},0,0,0,{"v":12800,"d":"$ 12,800"},0,{"v":13800,"d":"$ 13,800"},{"v":29700,"d":"$ 29,700"},0,{"v":39700,"d":"$ 39,700"},{"v":45500,"d":"$ 45,500"},0,0,0,0,{"v":200,"d":"$ 200"}]
[9,"SAN JUAN","GUAJIRA",0,0,{"v":5200,"d":"$ 5,200"},{"v":2200,"d":"$ 2,200"},{"v":10500,"d":"$ 10,500"},0,0,{"v":21700,"d":"$ 21,700"},0,0,0,{"v":27600,"d":"$ 27,600"},0,{"v":31200,"d":"$ 31,200"},0,0,0,0,{"v":5600,"d":"$ 5,600"},{"v":7400,"d":"$ 7,400"},{"v":7600,"d":"$ 7,600"},0,{"v":200,"d":"$ 200"}]
[10,"COCORNA","ANTIOQUIA",{"v":13500,"d":"$ 13,500"},{"v":1100,"d":"$ 1,100"},0,0,{"v":21200,"d":"$ 21,200"},{"v":1100,"d":"$ 1,100"},0,{"v":18600,"d":"$ 18,600"},{"v":1100,"d":"$ 1,100"},0,0,{"v":23100,"d":"$ 23,100"},{"v":1100,"d":"$ 1,100"},{"v":46400,"d":"$ 46,400"},0,0,{"v":66100,"d":"$ 66,100"},{"v":66100,"d":"$ 66,100"},0,0,0,0,{"v":200,"d":"$ 200"}]
[11,"PUERTO TRIUNFO","ANTIOQUIA",{"v":13500,"d":"$ 13,500"},0,0,0,{"v":21200,"d":"$ 21,200"},0,0,{"v":18600,"d":"$ 18,600"},0,0,0,{"v":23100,"d":"$ 23,100"},0,{"v":46400,"d":"$ 46,400"},0,0,{"v":66100,"d":"$ 66,100"},{"v":66100,"d":"$ 66,100"},0,0,0,0,{"v":200,"d":"$ 200"}]
{"$rows_left_out":62}
{"sheet":"FORMULARIO","index":3,"n_rows":2004,"n_cols":27,"rows_kept":2004,"merged":[[4,2,4,3],[6,2,6,4],[8,2,8,8],[8,10,8,12],[8,13,8,15],[8,21,8,22],[10,3,10,8],[10,10,10,12],[10,13,10,18],[10,19,10,20],[10,21,10,22],[11,3,11,8],[12,3,12,8],[12,13,12,18],[45,0,45,1]]}
[]
[null,"F-GF-019","FORMULARIO DE COMPRA",{"$nulls":22},1]
[null,null,"TIQUETES PREPAGO",{"$nulls":22},{"$f":"+Z2+1","v":2}]
[" ","VERSIÓN ","010",{"$nulls":22},{"$f":"+Z3+1","v":3}]
[null,"FECHA VERSIÓN","2024-04-01",{"$nulls":22},4]
[{"$nulls":25},5]
[null,"Fecha",{"$nulls":23},6]
[{"$nulls":25},7]
[null,"Nombre del Cliente",{"$nulls":8},"Documento ID",{"$nulls":9},"No.",{"$nulls":4},8]
[{"$nulls":25},9]
[null,"Direccion de envio Tiquetes",null," ",{"$nulls":6},"Ciudad",{"$nulls":8},"Departamento",{"$nulls":5},10]
[null,"Contacto",null," ",{"$nulls":21},11]
[null,"N° Celular Contacto",{"$nulls":10},"E_MAIL"," ",{"$nulls":11},12]
[{"$nulls":25},13]
["No.","Peaje","DEPARTAMENTO","Cant",{"$f":"+CONCATENATE(\"Tar Cat \",TARIFAS!D9)","v":"Tar Cat I"},"Cant",{"$f":"+CONCATENATE(\"Tar Cat \",TARIFAS!H9)","v":"Tar Cat II"},"Cant",{"$f":"+CONCATENATE(\"Tar Cat \",TARIFAS!K9)","v":"Tar Cat III"},"Cant",{"$f":"+CONCATENATE(\"Tar Cat \",TARIFAS!M9)","v":"Tar Cat IIIP"},"Cant",{"$f":"+CONCATENATE(\"Tar Cat \",TARIFAS!N9)","v":"Tar Cat IIIG"},"Cant",{"$f":"+CONCATENATE(\"Tar Cat \",TARIFAS!O9)","v":"Tar Cat IV"},"Cant",{"$f":"+CONCATENATE(\"Tar Cat \",TARIFAS!Q9)","v":"Tar Cat V"},"Cant",{"$f":"+CONCATENATE(\"Tar Cat \",TARIFAS!T9)","v":"Tar Cat VI"},"Cant",{"$f":"+CONCATENATE(\"Tar Cat \",TARIFAS!U9)","v":"Tar Cat VII"},"Total Cant","Valor total",null,null,14,{"$f":"+K9","v":"Documento ID"}]
[{"$f":"IF(B16>\"\",1,\"\")","v":1},"RIO BOGOTA",{"$f":"IF(B16=\"\",\"\",VLOOKUP(B16,TARIFAS!$B$49:$C$81,2,0))","v":"CUNDINAMARCA"},null,{"$f":"IF(B16=\"\",\"\",VLOOKUP(B16,TARIFAS!$B$51:$W$81,3,0))","v":{"v":11200,"d":"11,200"}},null,{"$f":"IF(B16=\"\",\"\",VLOOKUP(B16,TARIFAS!$B$51:$W$81,8,0))","v":{"v":16700,"d":"16,700"}},null,{"$f":"IF(B16=\"\",\"\",VLOOKUP(B16,TARIFAS!$B$51:$W$81,12,0))","v":{"v":14600,"d":"14,600"}},null,{"$f":"IF(B16=\"\",\"\",VLOOKUP(B16,TARIFAS!$B$51:$W$81,14,0))","v":0},null,{"$f":"IF(B16=\"\",\"\",VLOOKUP(B16,TARIFAS!$B$51:$W$81,15,0))","v":0},null,{"$f":"IF(B16=\"\",\"\",VLOOKUP(B16,TARIFAS!$B$51:$W$81,16,0))","v":{"v":19300,"d":"19,300"}},null,{"$f":"IF(B16=\"\",\"\",VLOOKUP(B16,TARIFAS!$B$51:$W$81,18,0))","v":{"v":32700,"d":"32,700"}},null,{"$f":"IF(B16=\"\",\"\",VLOOKUP(B16,TARIFAS!$B$51:$W$81,21,0))","v":{"v":44100,"d":"44,100"}},null,{"$f":"IF(B16=\"\",\"\",VLOOKUP(B16,TARIFAS!$B$51:$W$81,22,0))","v":{"v":47700,"d":"47,700"}},{"$f":"+IF(B16=\"\",\"\",IF(B16=$AA$32,D16+F16+H16+J16+L16+N16+P16+R16+T16,IF(B16=$AA$33,D16+F16+H16+J16+L16+N16+P16+R16+T16,IF(B16=$AA$34,D16+F16+H16+N16+P16+R16+T16,IF(B16=$AA$35,D16+F16+H16+N16+P16+R16+T16,IF(B16=$AA$36,D16+F16+H16+J16+L16+N16+P16+R16+T16,SUM(D16,F16,H16,N16,P16)))))))","v":0},{"$f":"+IF(C16=\"\",0,(D16*E16)+(F16*G16)+(H16*I16)+(J16*K16)+(L16*M16)+(N16*O16)+(P16*Q16)+(R16*S16)+(T16*U16))","v":0},null,null,15]
[{"$f":"IF(A16<1,\"\",IF(B17=\"\",\"\",IF(A16=\"\",\"\",A16+1)))","v":""},null,{"$f":"IF(B17=\"\",\"\",VLOOKUP(B17,TARIFAS!$B$49:$C$81,2,0))","v":""},null,{"$f":"IF(B17=\"\",\"\",VLOOKUP(B17,TARIFAS!$B$51:$W$81,3,0))","v":""},null,{"$f":"IF(B17=\"\",\"\",VLOOKUP(B17,TARIFAS!$B$51:$W$81,8,0))","v":""},null,{"$f":"IF(B17=\"\",\"\",VLOOKUP(B17,TARIFAS!$B$51:$W$81,12,0))","v":""},null,{"$f":"IF(B17=\"\",\"\",VLOOKUP(B17,TARIFAS!$B$51:$W$81,14,0))","v":""},null,{"$f":"IF(B17=\"\",\"\",VLOOKUP(B17,TARIFAS!$B$51:$W$81,15,0))","v":""},null,{"$f":"IF(B17=\"\",\"\",VLOOKUP(B17,TARIFAS!$B$51:$W$81,16,0))","v":""},null,{"$f":"IF(B17=\"\",\"\",VLOOKUP(B17,TARIFAS!$B$51:$W$81,18,0))","v":""},null,{"$f":"IF(B17=\"\",\"\",VLOOKUP(B17,TARIFAS!$B$51:$W$81,21,0))","v":""},null,{"$f":"IF(B17=\"\",\"\",VLOOKUP(B17,TARIFAS!$B$51:$W$81,22,0))","v":""},{"$f":"+IF(B17=\"\",\"\",IF(B17=$AA$32,D17+F17+H17+J17+L17+N17+P17+R17+T17,IF(B17=$AA$33,D17+F17+H17+J17+L17+N17+P17+R17+T17,IF(B17=$AA$34,D17+F17+H17+N17+P17+R17+T17,IF(B17=$AA$35,D17+F17+H17+N17+P17+R17+T17,IF(B17=$AA$36,D17+F17+H17+J17+L17+N17+P17+R17+T17,SUM(D17,F17,H17,N17,P17)))))))","v":""},{"$f":"+IF(C17=\"\",0,(D17*E17)+(F17*G17)+(H17*I17)+(J17*K17)+(L17*M17)+(N17*O17)+(P17*Q17)+(R17*S17)+(T17*U17))","v":0},null,null,16,"NIT"]
["",null,{"$f":"IF(B18=\"\",\"\",VLOOKUP(B18,TARIFAS!$B$49:$C$81,2,0))","v":""},null,{"$f":"IF(B18=\"\",\"\",VLOOKUP(B18,TARIFAS!$B$51:$W$81,3,0))","v":""},null,{"$f":"IF(B18=\"\",\"\",VLOOKUP(B18,TARIFAS!$B$51:$W$81,8,0))","v":""},null,{"$f":"IF(B18=\"\",\"\",VLOOKUP(B18,TARIFAS!$B$51:$W$81,12,0))","v":""},null,{"$f":"IF(B18=\"\",\"\",VLOOKUP(B18,TARIFAS!$B$51:$W$81,14,0))","v":""},null,{"$f":"IF(B18=\"\",\"\",VLOOKUP(B18,TARIFAS!$B$51:$W$81,15,0))","v":""},null,{"$f":"IF(B18=\"\",\"\",VLOOKUP(B18,TARIFAS!$B$51:$W$81,16,0))","v":""},null,{"$f":"IF(B18=\"\",\"\",VLOOKUP(B18,TARIFAS!$B$51:$W$81,18,0))","v":""},null,{"$f":"IF(B18=\"\",\"\",VLOOKUP(B18,TARIFAS!$B$51:$W$81,21,0))","v":""},null,{"$f":"IF(B18=\"\",\"\",VLOOKUP(B18,TARIFAS!$B$51:$W$81,22,0))","v":""},{"$f":"+IF(B18=\"\",\"\",IF(B18=$AA$32,D18+F18+H18+J18+L18+N18+P18+R18+T18,IF(B18=$AA$33,D18+F18+H18+J18+L18+N18+P18+R18+T18,IF(B18=$AA$34,D18+F18+H18+N18+P18+R18+T18,IF(B18=$AA$35,D18+F18+H18+N18+P18+R18+T18,SUM(D18,F18,H18,N18,P18))))))","v":""},0,null,null,17,"Pasaporte"]
["",null,{"$f":"IF(B19=\"\",\"\",VLOOKUP(B19,TARIFAS!$B$49:$C$81,2,0))","v":""},null,{"$f":"IF(B19=\"\",\"\",VLOOKUP(B19,TARIFAS!$B$51:$W$81,3,0))","v":""},null,{"$f":"IF(B19=\"\",\"\",VLOOKUP(B19,TARIFAS!$B$51:$W$81,8,0))","v":""},null,{"$f":"IF(B19=\"\",\"\",VLOOKUP(B19,TARIFAS!$B$51:$W$81,12,0))","v":""},null,{"$f":"IF(B19=\"\",\"\",VLOOKUP(B19,TARIFAS!$B$51:$W$81,14,0))","v":""},null,{"$f":"IF(B19=\"\",\"\",VLOOKUP(B19,TARIFAS!$B$51:$W$81,15,0))","v":""},null,{"$f":"IF(B19=\"\",\"\",VLOOKUP(B19,TARIFAS!$B$51:$W$81,16,0))","v":""},null,{"$f":"IF(B19=\"\",\"\",VLOOKUP(B19,TARIFAS!$B$51:$W$81,18,0))","v":""},null,{"$f":"IF(B19=\"\",\"\",VLOOKUP(B19,TARIFAS!$B$51:$W$81,21,0))","v":""},null,{"$f":"IF(B19=\"\",\"\",VLOOKUP(B19,TARIFAS!$B$51:$W$81,22,0))","v":""},"",0,null,null,18,"Cedula de Ciudadania"]
["",null,{"$f":"IF(B20=\"\",\"\",VLOOKUP(B20,TARIFAS!$B$49:$C$81,2,0))","v":""},null,{"$f":"IF(B20=\"\",\"\",VLOOKUP(B20,TARIFAS!$B$51:$W$81,3,0))","v":""},null,{"$f":"IF(B20=\"\",\"\",VLOOKUP(B20,TARIFAS!$B$51:$W$81,8,0))","v":""},null,{"$f":"IF(B20=\"\",\"\",VLOOKUP(B20,TARIFAS!$B$51:$W$81,12,0))","v":""},null,{"$f":"IF(B20=\"\",\"\",VLOOKUP(B20,TARIFAS!$B$51:$W$81,14,0))","v":""},null,{"$f":"IF(B20=\"\",\"\",VLOOKUP(B20,TARIFAS!$B$51:$W$81,15,0))","v":""},null,{"$f":"IF(B20=\"\",\"\",VLOOKUP(B20,TARIFAS!$B$51:$W$81,16,0))","v":""},null,{"$f":"IF(B20=\"\",\"\",VLOOKUP(B20,TARIFAS!$B$51:$W$81,18,0))","v":""},null,{"$f":"IF(B20=\"\",\"\",VLOOKUP(B20,TARIFAS!$B$51:$W$81,21,0))","v":""},null,{"$f":"IF(B20=\"\",\"\",VLOOKUP(B20,TARIFAS!$B$51:$W$81,22,0))","v":""},"",0,null,null,19,"Cedula de Extranjeria"]
{"$rows_left_out":1985}
{"sheet":"LIQUIDACION","index":4,"n_rows":55,"n_cols":26,"rows_kept":55,"merged":[[1,1,1,4],[6,2,6,7],[8,2,8,14],[10,2,10,9],[10,11,10,14],[12,2,12,14],[14,2,14,9],[14,10,14,12],[14,13,14,14],[15,2,15,9],[16,2,16,9],[17,2,17,9],[19,0,20,0],[19,1,20,1],[19,2,19,10],[19,14,20,14],[41,2,41,3],[41,4,41,8],[42,4,42,7],[44,2,46,10],[50,2,50,8],[52,2,52,10],[54,0,66,15]]}
[]
[null,"F-GF-020 FORMATO LIQUIDACIÓN COMPRA"]
[null,"TIQUETES PREPAGO"]
[null,"VERSIÓN 005"]
[null,"FECHA : 01/04/2024"]
[]
[null,"Fecha:",{"$f":"+IF(FORMULARIO!C7=\"\",\"\",FORMULARIO!C7)","v":""}]
[]
[null,"Nombre del Cliente",{"$f":"+IF(FORMULARIO!C9=\"\",\"\",FORMULARIO!C9)","v":""}]
[]
[null,"Documento de identidad",{"$f":"+IF(FORMULARIO!N9=\"\",\"\",FORMULARIO!N9)","v":""},{"$nulls":7},"No.",{"$f":"+IF(FORMULARIO!V9=\"\",\"\",FORMULARIO!V9)","v":""}]
[]
[null,"Direccion de envio Tiquetes",{"$f":"+IF(FORMULARIO!D11=\"\",\"\",FORMULARIO!D11)","v":" "}]
[]
[null,"Ciudad",{"$f":"+IF(FORMULARIO!N11=\"\",\"\",FORMULARIO!N11)","v":""},{"$nulls":7},"Departamento",null,null,{"$f":"+IF(FORMULARIO!V11=\"\",\"\",FORMULARIO!V11)","v":""}]
[null,"Contacto",{"$f":"+IF(FORMULARIO!D12=\"\",\"\",FORMULARIO!D12)","v":" "}]
[null,"N° Celular contacto",{"$f":"+IF(FORMULARIO!D13=\"\",\"\",FORMULARIO!D13)","v":""}]
[null,"E_MAIL",{"$f":"+IF(FORMULARIO!N13=\"\",\"\",FORMULARIO!N13)","v":" "}]
[]
["No.","PEAJE","CATEGORÍAS VEHICULARES",{"$nulls":10},"CANTIDAD","VALOR"]
{"$rows_left_out":35}